[zeromq-dev] czmq: zsocket_set_curve_server failed

Thomas Goertz thomas at tgoertz.de
Thu Mar 6 13:02:01 CET 2014


Peter,

Of course:

OS is Mac OS 10.9.2

gcc -version:
Configured with: --prefix=/Applications/Xcode.app/Contents/Developer/usr 
--with-gxx-include-dir=/usr/include/c++/4.2.1
Apple LLVM version 5.0 (clang-500.2.79) (based on LLVM 3.3svn)
Target: x86_64-apple-darwin13.1.0
Thread model: posix

Here is the output after make check:

Making check in src
make[1]: Nothing to be done for `check'.
Making check in doc
make[1]: Nothing to be done for `check'.
Making check in perf
make[1]: Nothing to be done for `check'.
Making check in tests
/Applications/Xcode.app/Contents/Developer/usr/bin/make  check-TESTS
W: Only able to create 242 sockets on this box
I: Tune your system to increase maximum allowed file handles
I: On OS/X, run 'ulimit -n 1200' in bashFAIL: test_system
PASS: test_pair_inproc
PASS: test_pair_tcp
PASS: test_reqrep_inproc
PASS: test_reqrep_tcp
PASS: test_hwm
PASS: test_reqrep_device
PASS: test_sub_forward
PASS: test_invalid_rep
PASS: test_msg_flags
PASS: test_connect_resolve
PASS: test_immediate
PASS: test_last_endpoint
PASS: test_term_endpoint
PASS: test_srcfd
PASS: test_monitor
Assertion failed: (rc == 0), function main, file test_resource.cpp, line 44.
/bin/sh: line 1: 44471 Abort trap: 6           ${dir}$tst
XFAIL: test_resource
PASS: test_router_mandatory
PASS: test_router_handover
PASS: test_probe_router
PASS: test_stream
PASS: test_stream_empty
PASS: test_stream_disconnect
PASS: test_disconnect_inproc
PASS: test_ctx_options
PASS: test_ctx_destroy
PASS: test_security_null
PASS: test_security_plain
CURVE I: cannot open client HELLO -- wrong server key?
CURVE I: cannot open client HELLO -- wrong server key?
CURVE I: cannot open client HELLO -- wrong server key?
CURVE I: cannot open client INITIATE vouch
CURVE I: cannot open client INITIATE vouch
CURVE I: cannot open client INITIATE vouch
CURVE I: cannot open client INITIATE vouch
CURVE I: cannot open client INITIATE vouch
CURVE I: ZAP handler rejected client authentication
CURVE I: ZAP handler rejected client authentication
CURVE I: ZAP handler rejected client authentication
PASS: test_security_curve
PASS: test_iov
PASS: test_spec_req
PASS: test_spec_rep
PASS: test_spec_dealer
PASS: test_spec_router
PASS: test_spec_pushpull
PASS: test_req_correlate
PASS: test_req_relaxed
PASS: test_conflate
PASS: test_inproc_connect
PASS: test_issue_566
PASS: test_proxy
Assertion failed: (rc == 0), function main, file test_abstract_ipc.cpp, 
line 31.
/bin/sh: line 1: 44875 Abort trap: 6           ${dir}$tst
XFAIL: test_abstract_ipc
PASS: test_many_sockets
PASS: test_ipc_wildcard
PASS: test_diffserv
Assertion failed: (s2), function main, file test_shutdown_stress.cpp, 
line 64.
/bin/sh: line 1: 44941 Abort trap: 6           ${dir}$tst
FAIL: test_shutdown_stress
PASS: test_pair_ipc
PASS: test_reqrep_ipc
PASS: test_timeo
PASS: test_fork
PASS: test_filter_ipc
============================================
2 of 51 tests failed
Please report to zeromq-dev at lists.zeromq.org
============================================
make[2]: *** [check-TESTS] Error 1
make[1]: *** [check-am] Error 2
make: *** [check-recursive] Error 1




More information about the zeromq-dev mailing list