[zeromq-dev] czmq: zsocket_set_curve_server failed

Thomas Goertz thomas at tgoertz.de
Thu Mar 6 11:33:22 CET 2014


Hi Peter,

I followed your advice, but after running the tests of libzmq I got the 
following errors:

/PASS: test_proxy//
//Assertion failed: (rc == 0), function main, file 
test_abstract_ipc.cpp, line 31.//
///bin/sh: line 1: 35149 Abort trap: 6           ${dir}$tst//
//XFAIL: test_abstract_ipc//
//PASS: test_many_sockets//
//PASS: test_ipc_wildcard//
//PASS: test_diffserv//
//Assertion failed: (s2), function main, file test_shutdown_stress.cpp, 
line 64.//
///bin/sh: line 1: 35215 Abort trap: 6           ${dir}$tst//
//FAIL: test_shutdown_stress//
//PASS: test_pair_ipc//
//PASS: test_reqrep_ipc//
//PASS: test_timeo//
//PASS: test_fork//
//PASS: test_filter_ipc//
//============================================//
//2 of 51 tests failed//
//Please report to zeromq-dev at lists.zeromq.org//
//============================================//
//make[2]: *** [check-TESTS] Error 1//
//make[1]: *** [check-am] Error 2//
//make: *** [check-recursive] Error 1//
/
Nevertheless I continued to build and install czmq, but the problem is 
still the same.

Any idea what I could do next?

Thomas
-------------- next part --------------
An HTML attachment was scrubbed...
URL: <https://lists.zeromq.org/pipermail/zeromq-dev/attachments/20140306/8d012f37/attachment.htm>


More information about the zeromq-dev mailing list