[zeromq-dev] czmq: zsocket_set_curve_server failed

Pieter Hintjens ph at imatix.com
Sun Mar 2 12:13:59 CET 2014


It's perhaps due to a mismatch between versions of libzmq. I'd take
the latest github master for libzmq, build and install that, then take
czmq and run ./configure, then build and test.

On Sun, Mar 2, 2014 at 9:16 AM, Thomas Goertz <thomas at tgoertz.de> wrote:
> Hi,
>
> I'm using Mac OS for zmq development and after reading the ZeroMQ Security
> Blog( http://hintjens.com/blog:49 ) of Pieter, I installed first libsodium
> and the czmq. I already had zmq installed and it workes fine.
>
> After running >make check< ind the czmq-directory, I get the following
> result:
>
> Making check in src
> /Applications/Xcode.app/Contents/Developer/usr/bin/make  check-TESTS
> Running CZMQ selftests...
>  * zrex: OK
>  * zsys: OK
>  * zconfig: OK
>  * zmutex: OK
>  * zclock: OK
>  * zchunk: OK
>  * zdir_patch: OK
>  * zdir: OK
>  * zdigest: OK
>  * zfile: OK
>  * zhash: OK
>  * ztree: OK
>  * zlist: OK
>  * zuuid: OK
>  * zctx: OK
> Assertion failed: (rc == 0 || zmq_errno () == ETERM), function
> zsocket_set_curve_server, file zsockopt.c, line 297.
>  * zsockopt: /bin/sh: line 1:  1664 Abort trap: 6           ${dir}$tst
> FAIL: czmq_selftest
> ============================================
> 1 of 1 test failed
> Please report to zeromq-dev at lists.zeromq.org
> ============================================
> make[2]: *** [check-TESTS] Error 1
> make[1]: *** [check-am] Error 2
> make: *** [check-recursive] Error 1
>
> What could be a possible reason for the test failing?
>
> Best regards,
> Thomas
>
> _______________________________________________
> zeromq-dev mailing list
> zeromq-dev at lists.zeromq.org
> http://lists.zeromq.org/mailman/listinfo/zeromq-dev
>



More information about the zeromq-dev mailing list