[zeromq-dev] libcurve make check failed

A. Mark gougolith at gmail.com
Sat Aug 30 03:43:29 CEST 2014


commit 194be05556f819513a6ace77ad386b9eb3ba1942
Merge: 4767fa6 1919f43
Author: Pieter Hintjens <ph at imatix.com>
Date:   Fri Jul 4 08:48:37 2014 +0200

    Merge pull request #20 from xpahos/master

    Fixed segfault in curve_selftest function curve_server

--------------------------------------------------------------
Making check in src
make[1]: Entering directory `/home/alian/Desktop/Temp/libcurve/src'
make  check-TESTS
make[2]: Entering directory `/home/alian/Desktop/Temp/libcurve/src'
 * curve_codec: OK
lt-curve_selftest: curve_client.c:457: server_task: Assertion `rc != -1'
failed.
 * curve_client: /bin/bash: line 5:  6968 Aborted                 (core
dumped) ${dir}$tst
FAIL: curve_selftest
============================================
1 of 1 test failed
Please report to zeromq-dev at lists.zeromq.org
============================================
make[2]: *** [check-TESTS] Error 1
make[2]: Leaving directory `/home/alian/Desktop/Temp/libcurve/src'
make[1]: *** [check-am] Error 2
make[1]: Leaving directory `/home/alian/Desktop/Temp/libcurve/src'
make: *** [check-recursive] Error 1

Mark
-------------- next part --------------
An HTML attachment was scrubbed...
URL: <https://lists.zeromq.org/pipermail/zeromq-dev/attachments/20140829/9c56a878/attachment.html>


More information about the zeromq-dev mailing list