[zeromq-dev] Fwd: zeromq 4.0.5 make check failure
Владимир Обухов
bobahml at mail.ru
Wed Apr 9 08:19:32 CEST 2014
I use Virtualbox - Ubuntu 13.10.
I try to build android native library for using in Xamarin.Monodroid project.
I follow this instruction: http://zeromq.org/build:android .
When I call make & make check command I see # FAIL: 43.
============================================================================
See tests/test-suite.log
Please report to zeromq-dev at lists.zeromq.org
============================================================================
make[3]: *** [test-suite.log] Error 1
make[3]: Leaving directory `/tmp/zeromq4-x/tests'
make[2]: *** [check-TESTS] Error 2
make[2]: Leaving directory `/tmp/zeromq4-x/tests'
make[1]: *** [check-am] Error 2
make[1]: Leaving directory `/tmp/zeromq4-x/tests'
make: *** [check-recursive] Error 1
[1]+ Done make
I attach log file.
gcc version 4.8.1 (Ubuntu/Linaro 4.8.1-10ubuntu9)
Help me please.
Thanks!
--
Vladimir
----------------------------------------------------------------------
--
Владимир Обухов
-------------- next part --------------
An HTML attachment was scrubbed...
URL: <https://lists.zeromq.org/pipermail/zeromq-dev/attachments/20140409/c97c90da/attachment.htm>
-------------- next part --------------
A non-text attachment was scrubbed...
Name: test-suite.log
Type: application/octet-stream
Size: 5639 bytes
Desc: not available
URL: <https://lists.zeromq.org/pipermail/zeromq-dev/attachments/20140409/c97c90da/attachment.obj>
More information about the zeromq-dev
mailing list