[zeromq-dev] 1 of 20 tests failed

Pieter Hintjens ph at imatix.com
Wed Oct 9 09:45:44 CEST 2013


Hi Carlos,

Can you provide the full listing, we need to know what package and
version you are testing, and what test failed. Also, what system you
are building on, and what compiler if it's not a standard one.

Thanks
Pieter

On Wed, Oct 9, 2013 at 4:45 AM, Carlos Rodríguez
<carlos.rdz at ideafactor-e.com> wrote:
> ============================================
> 1 of 20 tests failed
> Please report to zeromq-dev at lists.zeromq.org
> ============================================
> make[2]: *** [check-TESTS] Error 1
> make[1]: *** [check-am] Error 2
> make: *** [check-recursive] Error 1
> _______________________________________________
> zeromq-dev mailing list
> zeromq-dev at lists.zeromq.org
> http://lists.zeromq.org/mailman/listinfo/zeromq-dev



More information about the zeromq-dev mailing list