[zeromq-dev] make check failed

Leo Mata jigglyglen at gmail.com
Tue May 29 05:39:48 CEST 2012


I checked out the master branch of the 3.1 beta and in the make check I saw
one check failed with a note to report it here, so here I go:

PASS: test_monitor
test_shutdown_stress running...
/bin/bash: line 5: 20429 Segmentation fault      ${dir}$tst
FAIL: test_shutdown_stress
test_pair_ipc running...
PASS: test_pair_ipc
test_reqrep_ipc running...
PASS: test_reqrep_ipc
test_timeo running...
PASS: test_timeo
1 of 17 tests failed
Please report to zeromq-dev at lists.zeromq.org
make[2]: *** [check-TESTS] Error 1
make[2]: Leaving directory `/home/user/libzmq.git/tests'
make[1]: *** [check-am] Error 2
make[1]: Leaving directory `/home/user/libzmq.git/tests'
make: *** [check-recursive] Error 1

Let me know if I can provide any useful information or help out.

-------------- next part --------------
An HTML attachment was scrubbed...
URL: <https://lists.zeromq.org/pipermail/zeromq-dev/attachments/20120528/8acc6ec7/attachment.htm>

More information about the zeromq-dev mailing list