[zeromq-dev] libzmq make check error

李伟研 lweiyan at gmail.com
Mon Jun 4 16:12:36 CEST 2012


HI ALL.
   I clone libzmq at https://github.com/zeromq/libzmq.
     execute ./autogen.sh generation configure and ./configure generation
makefile
     make success
  but make check report error below

lt-test_connect_resolve: test_connect_resolve.cpp:44: int main(int,
char**): Assertion `rc == -1' failed.
/bin/bash: line 5: 13318 Aborted                 ${dir}$tst

============================================
1 of 17 tests failed
Please report to zeromq-dev at lists.zeromq.org
============================================
make[2]: *** [check-TESTS] Error 1
make[2]: Leaving directory `/home/lwy/share/libzmq/tests'
make[1]: *** [check-am] Error 2
make[1]: Leaving directory `/home/lwy/share/libzmq/tests'
make: *** [check-recursive] Error 1

environment:
          gcc version 4.6.1 (Ubuntu/Linaro 4.6.1-9ubuntu3)

Thanks.
-- 
lweiyan at gmail.com
15013117338
-------------- next part --------------
An HTML attachment was scrubbed...
URL: <https://lists.zeromq.org/pipermail/zeromq-dev/attachments/20120604/eb3702ba/attachment.htm>


More information about the zeromq-dev mailing list