[zeromq-dev] head builds again but two failing tests

Brian Knox briank at talksum.com
Fri Apr 20 20:42:47 CEST 2012


Don't have time to dig today but wanted to give a heads up.  Here's my GCC
info:

[laotse at moneta zeromq-git]$ gcc -v
Using built-in specs.
COLLECT_GCC=gcc
COLLECT_LTO_WRAPPER=/usr/lib/gcc/x86_64-unknown-linux-gnu/4.7.0/lto-wrapper
Target: x86_64-unknown-linux-gnu
Configured with: /build/src/gcc-4.7-20120407/configure --prefix=/usr
--libdir=/usr/lib --libexecdir=/usr/lib --mandir=/usr/share/man
--infodir=/usr/share/info
--with-bugurl=https://bugs.archlinux.org/--enable-languages=c,c++,ada,fortran,go,lto,objc,obj-c++
--enable-shared
--enable-threads=posix --with-system-zlib --enable-__cxa_atexit
--disable-libunwind-exceptions --enable-clocale=gnu --disable-libstdcxx-pch
--enable-libstdcxx-time --enable-gnu-unique-object --enable-linker-build-id
--with-ppl --enable-cloog-backend=isl --enable-lto --enable-gold
--enable-ld=default --enable-plugin --with-plugin-ld=ld.gold
--with-linker-hash-style=gnu --disable-multilib --disable-libssp
--disable-build-with-cxx --disable-build-poststage1-with-cxx
--enable-checking=release
Thread model: posix
gcc version 4.7.0 20120407 (prerelease) (GCC)

3.3.2 Linux kernel, x86_64

PASS: test_pair_inproc
test_pair_tcp running...
PASS: test_pair_tcp
test_reqrep_inproc running...
PASS: test_reqrep_inproc
test_reqrep_tcp running...
PASS: test_reqrep_tcp
test_hwm running...
PASS: test_hwm
test_reqrep_device running...
PASS: test_reqrep_device
test_sub_forward running...
PASS: test_sub_forward
test_invalid_rep running...
PASS: test_invalid_rep
PASS: test_msg_flags
test_connect_resolve running...
PASS: test_connect_resolve
PASS: test_last_endpoint
test_shutdown_stress running...
PASS: test_shutdown_stress
test_pair_ipc running...
/bin/sh: line 5:  4436 Segmentation fault      ${dir}$tst
FAIL: test_pair_ipc
test_reqrep_ipc running...
/bin/sh: line 5:  4461 Segmentation fault      ${dir}$tst
FAIL: test_reqrep_ipc
test_timeo running...
PASS: test_timeo
============================================
2 of 15 tests failed
Please report to zeromq-dev at lists.zeromq.org
============================================
make[2]: *** [check-TESTS] Error 1
make[2]: Leaving directory
`/home/laotse/src/BAT/research/briank/abs/zeromq-git/src/libzmq-build/tests'
make[1]: *** [check-am] Error 2
make[1]: Target `check' not remade because of errors.
make[1]: Leaving directory
`/home/laotse/src/BAT/research/briank/abs/zeromq-git/src/libzmq-build/tests'
make[1]: Entering directory
`/home/laotse/src/BAT/research/briank/abs/zeromq-git/src/libzmq-build'
make[1]: Nothing to be done for `check-am'.
make[1]: Leaving directory
`/home/laotse/src/BAT/research/briank/abs/zeromq-git/src/libzmq-build'
make: *** [check-recursive] Error 1
make: Target `check' not remade because of errors.
-------------- next part --------------
An HTML attachment was scrubbed...
URL: <https://lists.zeromq.org/pipermail/zeromq-dev/attachments/20120420/392b68aa/attachment.htm>


More information about the zeromq-dev mailing list