[zeromq-dev] One test Failed

Sriti Kumar sriti at vitrue.com
Wed Aug 31 20:29:31 CEST 2011


Hi
I was running the `make check' to run any self-tests out of 8 tests one
failed. Following is the output I got after running the command.

Making check in src
make[1]: Nothing to be done for `check'.
Making check in doc
make[1]: Nothing to be done for `check'.
Making check in perf
make[1]: Nothing to be done for `check'.
Making check in tests
make  check-TESTS
PASS: test_pair_inproc
PASS: test_pair_tcp
PASS: test_reqrep_inproc
PASS: test_reqrep_tcp
PASS: test_hwm
Too many open files
sock != -1 (tcp_listener.cpp:335)
/bin/sh: line 1: 29822 Abort trap              ${dir}$tst
FAIL: test_shutdown_stress
PASS: test_pair_ipc
PASS: test_reqrep_ipc
============================================
1 of 8 tests failed
Please report to zeromq-dev at lists.zeromq.org
============================================
make[2]: *** [check-TESTS] Error 1
make[1]: *** [check-am] Error 2
make: *** [check-recursive] Error 1


Thanks

Kumar
-------------- next part --------------
An HTML attachment was scrubbed...
URL: <https://lists.zeromq.org/pipermail/zeromq-dev/attachments/20110831/ccfc8790/attachment.htm>


More information about the zeromq-dev mailing list