[zeromq-dev] zeromq 2.0b2 compile error

Vitaly Mayatskikh v.mayatskih at gmail.com
Thu Feb 18 21:40:58 CET 2010


At Thu, 18 Feb 2010 14:40:59 -0500, jonathan morabito wrote:
> 
> Ah!  Thanks!  That was what I was missing!  I created a symlink in /lib64
> from "libuuid.so" to "libuuid.so.1", which in turn links to "libuuid.so.1.2"
> 
> Now configure completes successfully.  I now get the following errors on
> make:
> 
> "uuid.hpp:67: error: field 'uuid' has incomplete type
> uuid.cpp: In constructor 'zmq::uuid_t::uuid_t()':
> uuid.cpp:80: error: 'uuid' was not declared in this scope
> uuid.cpp:80: error: 'uuid_generate' was not declared in this scope
> uuid.cpp:81: error: 'uuid_unparse' was not declared in this scope
> make[2]: *** [libzmq_la-uuid.lo] Error 1"
> 
> Any thoughts?

yum install e2fsprogs-devel

-- 
wbr, Vitaly



More information about the zeromq-dev mailing list